BDBM87699 2-(4,5-dihydro-1,3-thiazol-2-ylsulfanyl)-N-(2,5-dimethoxyphenyl)acetamide::2-(4,5-dihydro-1,3-thiazol-2-ylsulfanyl)-N-(2,5-dimethoxyphenyl)ethanamide::2-(4,5-dihydro-1,3-thiazol-2-ylthio)-N-(2,5-dimethoxyphenyl)acetamide::2-(4,5-dihydrothiazol-2-ylthio)-N-(2,5-dimethoxyphenyl)acetamide::MLS000096973::N-(2,5-dimethoxyphenyl)-2-(2-thiazolin-2-ylthio)acetamide::SMR000074784::cid_857458
SMILES COc1ccc(OC)c(NC(=O)CSC2=NCCS2)c1
InChI Key InChIKey=XQDFMIIMGIQOLM-UHFFFAOYSA-N
Data  2 IC50
  Tab Delimited (TSV)   2D SDfile   Computed 3D by Vconf -m prep SDfile
Find this compound or compounds like it in BindingDB:
Activity Spreadsheet -- Enzyme Inhibition Constant Data from BindingDB
Found 2 hits for monomerid = 87699
TargetPolyadenylate-binding protein 1(Homo sapiens (Human))
Burnham Center For Chemical Genomics
Curated by PubChem BioAssay
LigandPNGBDBM87699(2-(4,5-dihydro-1,3-thiazol-2-ylsulfanyl)-N-(2,5-di...)
Affinity DataIC50: >6.60E+4nM. Assay description: Data Source: Sanford-Burnham Center for Chemical Genomics (SBCCG) Source Affiliation: Sanford-Burnham Medical Research Institute (SBMRI, San Diego, C...
In DepthDetails PCBioAssay
TargetPolyadenylate-binding protein 1(Homo sapiens (Human))
Burnham Center For Chemical Genomics
Curated by PubChem BioAssay
LigandPNGBDBM87699(2-(4,5-dihydro-1,3-thiazol-2-ylsulfanyl)-N-(2,5-di...)
Affinity DataIC50: >6.60E+4nM. Assay description: Data Source: Sanford-Burnham Center for Chemical Genomics (SBCCG) Source Affiliation: Sanford-Burnham Medical Research Institute (SBMRI, San Diego, C...
In DepthDetails PCBioAssay